report
preferred label: تقرير @ar
preferred label: hesabat @az
preferred label: informe @ca
preferred label: zpráva @cs
preferred label: rapport @da
preferred label: Bericht @de
preferred label: raportti @fi
preferred label: jelentés @hu
preferred label: rapporto @it
preferred label: 報告書 @ja
preferred label: relatório @pt
preferred label: raport @ro
preferred label: отчет @ru
preferred label: poročilo @sl
preferred label: izveštaj @sr
preferred label: извештај @sr-cyrl
preferred label: rapor @tr
preferred label: звіт @uk
preferred label: 报告 @zh
preferred label: έκθεση @gr

knowledge synthesis protocol
type: Concept
in scheme: scheme
preferred label: بروتوكول توليف المعرفة @ar
preferred label: biliyin sintezi protokolu @az
preferred label: protocol de síntesi del coneixement @ca
preferred label: systematisk protokol @da
preferred label: Wissenssyntheseprotokoll @de
preferred label: protocolo de síntesis del conocimiento @es
preferred label: systemaattisen katsauksen protokolla @fi
preferred label: protocole de synthèse @fr
preferred label: protocolo de síntese do coñecemento @gl
preferred label: szakirodalom áttekintési protokoll @hu
preferred label: protocollo di sintesi @it
preferred label: 知識統合プロトコル @ja
preferred label: 지식통합 프로토콜 @ko
preferred label: kennissynthese protocol @nl
preferred label: protocolo de síntese de conhecimentos @pt
preferred label: protocol de sinteză a cunostințelor @ro
preferred label: протокол синтеза знаний @ru
preferred label: metodologija raziskave @sl
preferred label: prokoll vid systematisk översikt @sv
preferred label: bilgi sentezi protokolü @tr
preferred label: протокол синтезу знань @uk
preferred label: 知识综合协议 @zh
preferred label: πρωτόκολλο σύνθεσης γνώσης @gr
alternative label: plan de síntesis del conocimiento @es
alternative label: plan de síntese do coñecemento @gl
alternative label: protocol de evaluare a cunostințelor @ro
alternative label: protokol za sintezo znanja @sl
alternative label: metodologija sinteze znanja @sl
alternative label: načrt raziskave @sl
broader: report
editorial note: New concept included t be added to upcoming version 4.0
change note:
  comment: initial version
  created: 2024-09-18T14:48:23+00:00
  creator: Isabel Bernal
definition: In the context of systematic reviews and meta-analyses, a protocol is a document that presents an explicit plan for a systematic review. The protocol details the rationale and a priori methodological and analytical approach of the review. https://www.bmj.com/content/349/bmj.g7647
change note:
  comment: Translations added for Arabic, Catalan, Danish, German, Spanish, French, Galician, Greek, Hungarian, Italian, Japanese, Korean, Portuguese, Romanian, Russian, Slovenian, Swedish, Turkish, Chinese. Broader Matches added.
  creator: Ellen Ramsey
  modified: 2024-11-29T23:48:29+00:00
change note:
  comment: Translation added for Ukrainian.
  creator: Ellen Ramsey
  modified: 2024-11-30T04:20:57+00:00
change note:
  comment: Capitalization of Italian and French corrected.
  creator: Ellen Ramsey
  modified: 2024-12-02T18:24:43+00:00
change note:
  comment: Added translations into Dutch and Finnish
  creator: Isabel Bernal
  modified: 2025-04-30T08:17:01+00:00
change note:
  comment: Added Azerbaijani
  creator: Tamy Nakano
  modified: 2025-07-17T16:49:11+00:00
broad match: d4e5605
broad match: http://purl.bioontology.org/ontology/MESH/D000078182