نص
preferred label: mətn @az
preferred label: text
preferred label: tekst @da
preferred label: Text @de
preferred label: texto @es
preferred label: teksti @fi
preferred label: texte @fr
preferred label: szöveg @hu
preferred label: testo @it
preferred label: テキスト @ja
preferred label: 텍스트 @ko
preferred label: текст @ru
preferred label: besedilo @sl
preferred label: metin @tr
preferred label: 文本 @zh
preferred label: κείμενο @gr

bibliography
type: Concept
in scheme: scheme
preferred label: قائمة مراجع @ar
preferred label: biblioqrafiya @az
preferred label: bibliografia @ca
preferred label: bibliografie @cs
preferred label: bibliografi @da
preferred label: Literaturverzeichnis @de
preferred label: bibliografía @es
preferred label: bibliographie @fr
preferred label: bibliográfia @hu
preferred label: 書誌 @ja
preferred label: 서지 @ko
preferred label: библиография @ru
preferred label: bibliografija @sl
preferred label: библиографија @sr-cyrl
preferred label: kaynakça @tr
preferred label: бібліографія @uk
preferred label: 文献目录 @zh
preferred label: βιβλιογραφία @gr
alternative label: přehled literatury @cs
alternative label: Bibliografie @de
alternative label: bibliyografya @tr
alternative label: 文獻目錄 @zh
alternative label: 書目 @zh
alternative label: 书目 @zh
broader: نص
definition: A list of the books and articles that have been used by someone when writing a particular book or article [Source: https://dictionary.cambridge.org/dictionary/english/bibliography]
change note:
  comment: Definition and source were updated.
  creator: Ilkay Holt
  modified: 2021-03-08T11:27:17+00:00
change note:
  comment: Russian translation was added.
  creator: Ilkay Holt
  modified: 2021-06-11T15:01:31+00:00
change note:
  creator: Ilkay Holt
  modified: 2021-07-08T08:34:28+00:00
change note:
  comment: Finnish translation was added.
  creator: Ilkay Holt
  modified: 2021-08-17T16:40:37+00:00
change note:
  comment: Serbian translation was added.
  creator: Milica Sevkusic
  modified: 2022-04-09T21:35:28+00:00
change note:
  comment: Translations added for Arabic, Danish, German, Galician, Greek, Hungarian, Korean, Romanian, Swedish. Related and Narrower Matches added.
  creator: Ellen Ramsey
  modified: 2024-11-29T02:45:11+00:00
change note:
  comment: Translation added for Ukrainian.
  creator: Ellen Ramsey
  modified: 2024-11-30T03:30:07+00:00
change note:
  comment: Added Azerbaijani
  creator: Tamy Nakano
  modified: 2025-07-16T22:48:04+00:00
broad match: Text
related match: d4e2195
narrow match: D016417