magazine
preferred label: مجلة @ar
preferred label: magazin jurnalı @az
preferred label: revista de divulgació @ca
preferred label: magasin @da
preferred label: Magazin @de
preferred label: revista divulgativa @es
preferred label: aikakauslehti @fi
preferred label: magazin @hu
preferred label: rivista divulgativa @it
preferred label: 雑誌 @ja
preferred label: 잡지 @ko
preferred label: tijdschrift @nl
preferred label: revista de divulgação @pt
preferred label: периодическое печатное издание @ru
preferred label: informativna revija @sl
preferred label: информативна ревија @sr-cyrl
preferred label: журнал @uk
preferred label: 杂志 @zh

magazine article
type: Concept
in scheme: scheme
preferred label: مقال في مجلة @ar
preferred label: jurnal məqaləsi @az
preferred label: article de divulgació @ca
preferred label: magasinartikel @da
preferred label: Zeitschriftenartikel @de
preferred label: artículo de magacín @es
preferred label: aikakauslehtiartikkeli @fi
preferred label: article de magazine @fr
preferred label: artigo de revista divulgativa @gl
preferred label: magazincikk @hu
preferred label: articolo in rivista @it
preferred label: 雑誌記事 @ja
preferred label: 잡지 기사 @ko
preferred label: tijdschriftartikel @nl
preferred label: artigo em revista @pt
preferred label: časopisni članek @sl
preferred label: članak u informativnoj reviji @sr
preferred label: чланак у информативној ревији @sr-cyrl
preferred label: artikel i magasin @sv
preferred label: magazin makalesi @tr
preferred label: стаття у журналі @uk
alternative label: articolo scientifico @it
alternative label: članak u magazinu @sr
alternative label: чланак у магазину @sr-cyrl
broader: magazine
change note:
  comment: Inconsistency found with same term used for journal article.
  creator: Tamy Nakano
  modified: 2025-07-17T16:08:17+00:00
change note:
  comment: Added Azerbajani
  creator: Tamy Nakano
  modified: 2025-07-22T12:45:58+00:00
change note:
  comment: Translation removed for Ukrainian, cannot be the same as for journal article.
  creator: Ellen Ramsey
  modified: 2024-11-30T04:05:47+00:00
change note:
  comment: initial version
  created: 2024-09-18T12:09:52+00:00
  creator: Isabel Bernal
definition: An Item appearing in a magazine (a general interest or specific focus periodical). This item is often shorter in length, is submitted by in-house and external authors. Adapted from MAGAZINE Definition & Meaning - Black's Law Dictionary (thelawdictionary.org)
editorial note: New concept added to be included in upcoming version 4.0
change note:
  comment: Translations added for Arabic, Catalan, Danish, German, Spanish, French, Galician, Greek, Hungarian, Italian, Japanese, Korean, Portuguese, Romanian, Russian, Slovenian, Serbian-Latin, Serbian-Cyrillic, Swedish, Turkish. Exact Matches added.
  creator: Ellen Ramsey
  modified: 2024-11-29T20:49:26+00:00
change note:
  comment: Ukrainian update per Iryna Kuchma.
  creator: Ellen Ramsey
  modified: 2024-12-02T17:43:07+00:00
change note:
  comment: Capitalization of Italian corrected.
  creator: Ellen Ramsey
  modified: 2024-12-02T18:23:45+00:00
change note:
  comment: Added translations into Dutch and Finnish
  creator: Isabel Bernal
  modified: 2025-04-30T08:14:32+00:00