collection
preferred label: مجموعة @ar
preferred label: kolleksiya @az
preferred label: col·lecció @ca
preferred label: samling @da
preferred label: Sammlung @de
preferred label: colección @es
preferred label: kokoelma @fi
preferred label: gyűjtemény @hu
preferred label: collezione @it
preferred label: コレクション @ja
preferred label: 컬렉션 @ko
preferred label: collectie @nl
preferred label: coleção @pt
preferred label: colecție @ro
preferred label: коллекция @ru
preferred label: kolekcija @sl
preferred label: zbirka @sr
preferred label: збирка @sr-cyrl
preferred label: koleksiyon @tr
preferred label: колекція @uk
preferred label: 收藏品 @zh
preferred label: συλλογή @gr

archival collection
type: Concept
in scheme: scheme
preferred label: مجموعة أرشيفية @ar
preferred label: arxiv kolleksiyası @az
preferred label: col·lecció d'arxiu @ca
preferred label: arkivsamling @da
preferred label: Archivsammlung @de
preferred label: colección de archivo @es
preferred label: arkistokokoelma @fi
preferred label: fonds d'archives @fr
preferred label: colección arquivística @gl
preferred label: archív állomány @hu
preferred label: collezione archivistica @it
preferred label: アーカイブコレクション @ja
preferred label: 아카이브 컬렉션 @ko
preferred label: archiefcollectie @nl
preferred label: acervo arquivístico @pt
preferred label: colecţie arhivală @ro
preferred label: архивная коллекция @ru
preferred label: arhivska zbirka @sl
preferred label: архивска збирка @sr-cyrl
preferred label: arşiv koleksiyonu @tr
preferred label: архівна колекція @uk
preferred label: 档案收藏 @zh
preferred label: αρχειακή συλλογή @gr
alternative label: fons @ca
alternative label: fondo @es
alternative label: collection d'archives @fr
alternative label: fondo arquivístico @gl
alternative label: archivio @it
alternative label: coleção arquivística @pt
alternative label: arhivska kolekcija @sr
broader: collection
change note:
  comment: initial version
  created: 2024-09-30T11:28:25+00:00
  creator: Isabel Bernal
definition: A collection of historical records and primary source documents. Documents may be tangible or digital. Adapted from “archive (groupings)” in Getty AAT: https://www.getty.edu/vow/AATFullDisplay?find=maiolica&logic=AND&note=&subjectid=300375748
editorial note: New concept included for version 4 of resource type Vocab
change note:
  comment: Translations added for Arabic, Catalan, Danish, German, Spanish, French, Galician, Greek, Hungarian, Italian, Japanese, Korean, Portuguese, Romanian, Russian, Slovenian, Serbian-Latin, Serbian-Cyrillic, Swedish, Turkish, Chinese. Broader Matches added.
  creator: Ellen Ramsey
  modified: 2024-11-27T18:42:11+00:00
change note:
  comment: Translation for Ukrainian added.
  creator: Ellen Ramsey
  modified: 2024-11-30T02:54:00+00:00
change note:
  comment: Capitalization corrected for Italian.
  creator: Ellen Ramsey
  modified: 2024-12-02T18:01:03+00:00
change note:
  comment: Case corrected for Italian.
  creator: Ellen Ramsey
  modified: 2024-12-02T18:01:49+00:00
change note:
  comment: Added translations into Dutch and Finnish
  creator: Isabel Bernal
  modified: 2025-04-30T08:01:37+00:00
change note:
  comment: Added Azerbaijani
  creator: Tamy Nakano
  modified: 2025-07-16T21:15:51+00:00
broad match: Collection