moving image
preferred label: صورة متحركة @ar
preferred label: hərəkətli şəkil @az
preferred label: imatge en moviment @ca
preferred label: pohyblivý obraz @cs
preferred label: Bewegte Bilder @de
preferred label: imagen dinámica @es
preferred label: liikkuva kuva @fi
preferred label: image animée @fr
preferred label: imaxe en movemento @gl
preferred label: mozgókép @hu
preferred label: immagine dinamica @it
preferred label: 動画 @ja
preferred label: 동영상 @ko
preferred label: filmmateriaal @nl
preferred label: imagem animada @pt
preferred label: imagine în mișcare @ro
preferred label: движущееся изображение @ru
preferred label: gibljiva slika @sl
preferred label: pokretne slike @sr
preferred label: покретне слике @sr-cyrl
preferred label: rörlig bild @sv
preferred label: hareketli görüntü @tr
preferred label: рухоме зображення @uk
preferred label: 运动图像 @zh
preferred label: κινούμενες εικόνες @gr

فيديو
type: Concept
in scheme: scheme
preferred label: video
preferred label: vídeo @ca
preferred label: Video @de
preferred label: vidéo @fr
preferred label: videó @hu
preferred label: 録画資料 @ja
preferred label: 비디오 @ko
preferred label: видео @ru
preferred label: відео @uk
preferred label: 视频 @zh
alternative label: film @ro
alternative label: video zapis @sr
alternative label: видео запис @sr-cyrl
alternative label: 視頻 @zh
alternative label: 动态影像 @zh
alternative label: 動態影像 @zh
broader: moving image
definition: Media that makes use of images (usually "moving"), with or without sound, over a period of playback time. [Source :https://support.contributors.jstor.org/hc/en-us/articles/11971132444439-JSTOR-Content-and-Resource-Types]
change note:
  comment: Russian translation was added.
  creator: Ilkay Holt
  modified: 2021-06-11T14:12:38+00:00
editorial note: Published
change note:
  comment: Finnish translation was added.
  creator: Ilkay Holt
  modified: 2021-08-17T16:29:16+00:00
change note:
  comment: Serbian translation was added.
  creator: Milica Sevkusic
  modified: 2022-04-09T20:05:13+00:00
change note:
  comment: Translations added for Arabic, Danish, Galician, Greek, Hungarian, Korean, Romanian, Swedish. Exact Matches added.
  creator: Ellen Ramsey
  modified: 2024-11-28T13:46:58+00:00
change note:
  comment: Translation added for Ukrainian.
  creator: Ellen Ramsey
  modified: 2024-11-30T03:12:25+00:00
change note:
  comment: Definition enhanced and corrected per Isabel Bernal.
  creator: Ellen Ramsey
  modified: 2024-12-04T14:01:54+00:00
change note:
  comment: Added Azarbaijani
  creator: Tamy Nakano
  modified: 2025-07-16T21:51:58+00:00
broad match: Movie
broad match: MovingImage